No title

1
2
3
4
5
6
7
8
9
10
make[1]: Leaving directory '/home/lol/p/wine64-build/dlls/wmvcore'
make[1]: Entering directory '/home/lol/p/wine64-build/dlls/wmvcore/tests'
../../../tools/winegcc/winegcc -o wmvcore_test-stripped.exe.so -B../../../tools/winebuild -m64 -fasynchronous-unwind-tables \
  -Wb,-F,wmvcore_test.exe wmvcore_main.o testlist.o -lwmvcore_main 
/usr/lib/gcc/x86_64-pc-linux-gnu/6.2.0/../../../../x86_64-pc-linux-gnu/bin/ld: cannot find -lwmvcore_main
collect2: error: ld returned 1 exit status
winegcc: gcc failed
make[1]: *** [Makefile:223: wmvcore_test-stripped.exe.so] Error 2
make[1]: Leaving directory '/home/lol/p/wine64-build/dlls/wmvcore/tests'
make: *** [Makefile:18391: dlls/wmvcore/tests] Error 2