No title

Anonymous Coward 2018-03-08 18:23:06.706751 UTC

1make -C libffi/build MAKEFLAGS= install
2Makefile:3406: warning: overriding recipe for target 'libffi.map'
3Makefile:731: warning: ignoring old recipe for target 'libffi.map'
4MAKE x86_64-pc-linux-gnu : 0 * install
5make[3]: Entering directory '/home/moritz/Downloads/ghc-8.4.1/libffi/build/x86_64-unknown-linux-gnu'
6Makefile:1804: warning: overriding recipe for target 'libffi.map'
7Makefile:672: warning: ignoring old recipe for target 'libffi.map'
8Making install in include
9make[4]: Entering directory '/home/moritz/Downloads/ghc-8.4.1/libffi/build/x86_64-unknown-linux-gnu/include'
10make[5]: Entering directory '/home/moritz/Downloads/ghc-8.4.1/libffi/build/x86_64-unknown-linux-gnu/include'
11make[5]: Nothing to be done for 'install-exec-am'.
12 /usr/bin/mkdir -p '/home/moritz/Downloads/ghc-8.4.1/libffi/build/inst/include'
13 /usr/bin/install -c -m 644 ffi.h ffitarget.h '/home/moritz/Downloads/ghc-8.4.1/libffi/build/inst/include'
14make[5]: Leaving directory '/home/moritz/Downloads/ghc-8.4.1/libffi/build/x86_64-unknown-linux-gnu/include'
15make[4]: Leaving directory '/home/moritz/Downloads/ghc-8.4.1/libffi/build/x86_64-unknown-linux-gnu/include'
16Making install in testsuite
17make[4]: Entering directory '/home/moritz/Downloads/ghc-8.4.1/libffi/build/x86_64-unknown-linux-gnu/testsuite'
18make[5]: Entering directory '/home/moritz/Downloads/ghc-8.4.1/libffi/build/x86_64-unknown-linux-gnu/testsuite'
19make[5]: Nothing to be done for 'install-exec-am'.
20make[5]: Nothing to be done for 'install-data-am'.
21make[5]: Leaving directory '/home/moritz/Downloads/ghc-8.4.1/libffi/build/x86_64-unknown-linux-gnu/testsuite'
22make[4]: Leaving directory '/home/moritz/Downloads/ghc-8.4.1/libffi/build/x86_64-unknown-linux-gnu/testsuite'
23Making install in man
24make[4]: Entering directory '/home/moritz/Downloads/ghc-8.4.1/libffi/build/x86_64-unknown-linux-gnu/man'
25make[5]: Entering directory '/home/moritz/Downloads/ghc-8.4.1/libffi/build/x86_64-unknown-linux-gnu/man'
26make[5]: Nothing to be done for 'install-exec-am'.
27 /usr/bin/mkdir -p '/home/moritz/Downloads/ghc-8.4.1/libffi/build/inst/share/man/man3'
28 /usr/bin/install -c -m 644 ../../man/ffi.3 ../../man/ffi_call.3 ../../man/ffi_prep_cif.3 ../../man/ffi_prep_cif_var.3 '/home/moritz/Downloads/ghc-8.4.1/libffi/build/inst/share/man/man3'
29make[5]: Leaving directory '/home/moritz/Downloads/ghc-8.4.1/libffi/build/x86_64-unknown-linux-gnu/man'
30make[4]: Leaving directory '/home/moritz/Downloads/ghc-8.4.1/libffi/build/x86_64-unknown-linux-gnu/man'
31make[4]: Entering directory '/home/moritz/Downloads/ghc-8.4.1/libffi/build/x86_64-unknown-linux-gnu'
32Makefile:1804: warning: overriding recipe for target 'libffi.map'
33Makefile:672: warning: ignoring old recipe for target 'libffi.map'
34make[5]: Entering directory '/home/moritz/Downloads/ghc-8.4.1/libffi/build/x86_64-unknown-linux-gnu'
35Makefile:1804: warning: overriding recipe for target 'libffi.map'
36Makefile:672: warning: ignoring old recipe for target 'libffi.map'
37 /usr/bin/mkdir -p '/home/moritz/Downloads/ghc-8.4.1/libffi/build/inst/lib'
38 /bin/sh ./libtool --mode=install /usr/bin/install -c libffi.la '/home/moritz/Downloads/ghc-8.4.1/libffi/build/inst/lib'
39libtool: install: /usr/bin/install -c .libs/libffi.so.7.1.0 /home/moritz/Downloads/ghc-8.4.1/libffi/build/inst/lib/libffi.so.7.1.0
40/usr/bin/install: cannot stat '.libs/libffi.so.7.1.0': No such file or directory
41make[5]: *** [Makefile:687: install-toolexeclibLTLIBRARIES] Error 1
42make[5]: Leaving directory '/home/moritz/Downloads/ghc-8.4.1/libffi/build/x86_64-unknown-linux-gnu'
43make[4]: *** [Makefile:1615: install-am] Error 2
44make[4]: Leaving directory '/home/moritz/Downloads/ghc-8.4.1/libffi/build/x86_64-unknown-linux-gnu'
45make[3]: *** [Makefile:1311: install-recursive] Error 1
46make[3]: Leaving directory '/home/moritz/Downloads/ghc-8.4.1/libffi/build/x86_64-unknown-linux-gnu'
47make[2]: *** [Makefile:2870: install] Error 2
48libraries/haskeline/ghc.mk:4: libraries/haskeline/dist-install/build/.depend-v-p-dyn.haskell: No such file or directory
49make[1]: *** [libffi/ghc.mk:120: libffi/stamp.ffi.static-shared.install] Error 2
50make[1]: *** Waiting for unfinished jobs....
51<<ghc: 4625734344 bytes, 332 GCs, 11915932/45614792 avg/max bytes residency (8 samples), 94M in use, 0.000 INIT (0.000 elapsed), 1.871 MUT (4.036 elapsed), 0.219 GC (0.220 elapsed) :ghc>>
52echo "compiler_stage2_depfile_haskell_EXISTS = YES" >> compiler/stage2/build/.depend-v-p-dyn.haskell.tmp
53for dir in compiler/stage2/build/./ compiler/stage2/build/CodeGen/ compiler/stage2/build/CodeGen/Platform/ compiler/stage2/build/Dwarf/ compiler/stage2/build/Hoopl/ compiler/stage2/build/Llvm/ compiler/stage2/build/LlvmCodeGen/ compiler/stage2/build/PPC/ compiler/stage2/build/RegAlloc/ compiler/stage2/build/RegAlloc/Graph/ compiler/stage2/build/RegAlloc/Linear/ compiler/stage2/build/RegAlloc/Linear/PPC/ compiler/stage2/build/RegAlloc/Linear/SPARC/ compiler/stage2/build/RegAlloc/Linear/X86/ compiler/stage2/build/RegAlloc/Linear/X86_64/ compiler/stage2/build/SPARC/ compiler/stage2/build/SPARC/CodeGen/ compiler/stage2/build/SysTools/ compiler/stage2/build/Vectorise/ compiler/stage2/build/Vectorise/Builtins/ compiler/stage2/build/Vectorise/Generic/ compiler/stage2/build/Vectorise/Monad/ compiler/stage2/build/Vectorise/Type/ compiler/stage2/build/Vectorise/Utils/ compiler/stage2/build/X86/; do if test ! -d $dir; then mkdir -p $dir; fi done
54grep -v ' : [a-zA-Z]:/' compiler/stage2/build/.depend-v-p-dyn.haskell.tmp > compiler/stage2/build/.depend-v-p-dyn.haskell.tmp2
55sed -e '/hs$/ p' -e '/hs$/ s/o /hi /g' -e '/hs$/ s/:/ : %hi: %o /' -e '/hs$/ s/^/$(eval $(call hi-rule,/' -e '/hs$/ s/$/))/' -e '/hs-boot$/ p' -e '/hs-boot$/ s/o-boot /hi-boot /g' -e '/hs-boot$/ s/:/ : %hi-boot: %o-boot /' -e '/hs-boot$/ s/^/$(eval $(call hi-rule,/' -e '/hs-boot$/ s/$/))/' compiler/stage2/build/.depend-v-p-dyn.haskell.tmp2 > compiler/stage2/build/.depend-v-p-dyn.haskell
56make: *** [Makefile:127: all] Error 2